{"text_format":"3","workbook":"xlsx","n_sheets":12,"sheets":["MENU","D","I","E","ND","NC","DIARIO","MAYOR","BALANCE","GENERAL","RESULTADO","Hoja1"],"not_rendered":{"images":21,"macros":1,"defined_names":48},"read":"whole","date_system":"1900"}

{"sheet":"MENU","index":0,"n_rows":23,"n_cols":11,"rows_kept":23,"merged":[[0,2,0,13],[1,1,1,3],[1,5,1,7],[1,10,1,12],[15,6,16,6]]}
[null,null,"NOMBRE DE LA EMPRESA X"]
[null,"CONTABILIZAR",{"$nulls":3},"REPORTES",{"$nulls":4},"CONFIGURACIONES"]
{"$rows_empty":13}
[{"$nulls":4},"SELECIONE EL CODIGO DE CTA",null,"1.1.1.1.002"]
[{"$nulls":4},"PARA PRESENTAR EL LIBRO MAYOR"]
[]
[null,"NOTA:"]
[]
[null,"ESTE ES LA VERSION BASICA Y NO TIENE TODAS LAS FUNCIONALIDADES…",{"$nulls":5},"SI QUIERES SABER COMO FUE CREADO ESTE SISTEMA Y TAMBIEN QUIERES"]
[null,"SI ESTAS INTERESADO EN LA VERSION COMPLETA VISITA LA PAGINA",{"$nulls":5},"APRENDER A CREAR PLANTILLAS AUTOMATICAS VISITA LA PAGINA:"]
[1,"http://aplicaexcelcontable.com/Alumnos/tu-plantilla-contable-2",{"$nulls":4},2,"http://aplicaexcelcontable.com/Alumnos/aplica-excel-contable-21"]

{"sheet":"D","index":1,"n_rows":61,"n_cols":31,"rows_kept":61,"merged":[[0,2,0,6],[0,26,0,30],[1,7,1,11],[2,26,2,30],[5,2,7,6],[5,26,8,30],[20,2,23,3]]}
[null,null,"ASIENTO DE DIARIO",{"$nulls":23},{"$f":"MENU!C1","v":"NOMBRE DE LA EMPRESA X"}]
[null,null,"ASI-",{"$f":"MAX(DIARIO!B2:B1000)+1","v":3},{"$nulls":3},"PLAN DE CUENTAS"]
[null,null,"Nº ASIENTO:",2,"FECHA:","2012-02-01",{"$nulls":20},{"$f":"C1","v":"ASIENTO DE DIARIO"}]
[{"$nulls":29},"ASI Nº:",{"$f":"D3","v":2}]
[null,null,"CONCEPTO:",{"$nulls":23},"CONCEPTO:",null,null,"FECHA:",{"$f":"F3","v":"2012-02-01"}]
[null,null,"PRUEBA",{"$nulls":23},{"$f":"C6","v":"PRUEBA"}]
[]
[]
[null,null,"CODIGO","DESCRIPCION","DEBE","HABER","DETALLES"]
[null,null,"1.1.2.1.002",{"$f":"IF(C10<>\"\",VLOOKUP(C10,PLAN,2,0),\"\")","v":"CUENTAS POR COBRAR EMPLEADOS"},500,null,"ALEX CARRILLO",{"$nulls":19},"CODIGO","DESCRIPCION","DEBE","HABER","DETALLES"]
[null,null,"1.1.1.1.001","CAJA GENERAL",null,500,"ALEX CARRILLO"]
[{"$nulls":3},""]
[{"$nulls":3},""]
[{"$nulls":3},""]
[{"$nulls":3},""]
[{"$nulls":3},""]
[{"$nulls":3},""]
[{"$nulls":3},""]
[{"$nulls":3},"HAZ CLIC EN EL BONTON\n NUEVA LINEA"]
[null,null,"NOTAS:","TOTAL",{"$f":"SUM(E10:E19)","v":{"v":500,"d":"500.00 "}},{"$f":"SUM(F10:F19)","v":{"v":500,"d":"500.00 "}},{"$f":"IF(F21<>0,\"OJO ASIENTO NO CUADRA\",\"\")","v":""}]
[{"$nulls":5},{"$f":"E20-F20","v":0}]
{"$rows_empty":34}
[{"$nulls":27},"SUMAN",{"$f":"SUM(AC11:AC55)","v":0},{"$f":"SUM(AD11:AD55)","v":0}]
[]
[]
[]
[]
[{"$nulls":26},"               ELABORADO POR",null,"RIVISADO POR",null,"AUTORIZADO POR"]

{"sheet":"I","index":2,"n_rows":61,"n_cols":31,"rows_kept":61,"merged":[[0,2,0,6],[0,26,0,30],[1,7,1,11],[2,26,2,30],[5,2,7,6],[5,26,8,30],[20,2,23,3]]}
[null,null,"COMPROBANTE DE INGRESO",{"$nulls":23},{"$f":"MENU!C1","v":"NOMBRE DE LA EMPRESA X"}]
[null,null,"CIN-",{"$f":"MAX(DIARIO!C2:C1000)+1","v":2},{"$nulls":3},"PLAN DE CUENTAS"]
[null,null,"INGRESO Nº:",null,"FECHA:","2013-09-22",{"$nulls":20},{"$f":"C1","v":"COMPROBANTE DE INGRESO"}]
[{"$nulls":29},"ASI Nº:",{"$f":"D3","v":0}]
[null,null,"CONCEPTO:",{"$nulls":23},"CONCEPTO:",null,null,"FECHA:",{"$f":"F3","v":"2013-09-22"}]
[{"$nulls":26},{"$f":"C6","v":0}]
[]
[]
[null,null,"CODIGO","DESCRIPCION","DEBE","HABER","DETALLES"]
[{"$nulls":3},{"$f":"IF(C10<>\"\",VLOOKUP(C10,PLAN,2,0),\"\")","v":""},{"$nulls":22},"CODIGO","DESCRIPCION","DEBE","HABER","DETALLES"]
[{"$nulls":3},""]
[{"$nulls":3},""]
[{"$nulls":3},""]
[{"$nulls":3},""]
[{"$nulls":3},""]
[{"$nulls":3},""]
[{"$nulls":3},""]
[{"$nulls":3},""]
[{"$nulls":3},"HAZ CLIC EN EL BONTON\n NUEVA LINEA"]
[null,null,"NOTAS:","TOTAL",{"$f":"SUM(E10:E19)","v":0},{"$f":"SUM(F10:F19)","v":0},{"$f":"IF(F21<>0,\"OJO ASIENTO NO CUADRA\",\"\")","v":""}]
[null,null,"XXXSSX",null,null,{"$f":"E20-F20","v":0}]
{"$rows_empty":34}
[{"$nulls":27},"SUMAN",{"$f":"SUM(AC11:AC55)","v":0},{"$f":"SUM(AD11:AD55)","v":0}]
[]
[]
[]
[]
[{"$nulls":26},"               ELABORADO POR",null,"RIVISADO POR",null,"AUTORIZADO POR"]

{"sheet":"E","index":3,"n_rows":61,"n_cols":31,"rows_kept":61,"merged":[[0,2,0,6],[0,26,0,30],[1,7,1,11],[2,26,2,30],[3,5,3,6],[4,5,4,6],[5,2,7,6],[5,26,8,30],[20,2,23,3]]}
[null,null,"COMPROBANTE DE EGRESO",{"$nulls":23},{"$f":"MENU!C1","v":"NOMBRE DE LA EMPRESA X"}]
[null,null,"CEG-",{"$f":"MAX(DIARIO!D2:D1000)+1","v":2},{"$nulls":3},"PLAN DE CUENTAS"]
[null,null,"EGRESO Nº:",null,"FECHA:",{"$nulls":21},{"$f":"C1","v":"COMPROBANTE DE EGRESO"}]
[null,null,"CHEQUE Nº:",null,"BENIFICIARIO",{"$nulls":24},"ASI Nº:",{"$f":"D3","v":0}]
[null,null,"CONCEPTO:",null,"CUENTA Nº:",{"$nulls":21},"CONCEPTO:",null,null,"FECHA:",{"$f":"F3","v":"00:00:00"}]
[{"$nulls":26},{"$f":"C6","v":0}]
[]
[]
[null,null,"CODIGO","DESCRIPCION","DEBE","HABER","DETALLES"]
[{"$nulls":3},{"$f":"IF(C10<>\"\",VLOOKUP(C10,PLAN,2,0),\"\")","v":""},{"$nulls":22},"CODIGO","DESCRIPCION","DEBE","HABER","DETALLES"]
[{"$nulls":3},""]
[{"$nulls":3},""]
[{"$nulls":3},""]
[{"$nulls":3},""]
[{"$nulls":3},""]
[{"$nulls":3},""]
[{"$nulls":3},""]
[{"$nulls":3},""]
[{"$nulls":3},"HAZ CLIC EN EL BONTON\n NUEVA LINEA"]
[null,null,"NOTAS:","TOTAL",{"$f":"SUM(E10:E19)","v":0},{"$f":"SUM(F10:F19)","v":0},{"$f":"IF(F21<>0,\"OJO ASIENTO NO CUADRA\",\"\")","v":""}]
[{"$nulls":5},{"$f":"E20-F20","v":0}]
{"$rows_empty":34}
[{"$nulls":27},"SUMAN",{"$f":"SUM(AC11:AC55)","v":0},{"$f":"SUM(AD11:AD55)","v":0}]
[]
[]
[]
[]
[{"$nulls":26},"               ELABORADO POR",null,"RIVISADO POR",null,"AUTORIZADO POR"]

{"sheet":"ND","index":4,"n_rows":61,"n_cols":31,"rows_kept":61,"merged":[[0,2,0,6],[0,26,0,30],[1,7,1,11],[2,26,2,30],[5,2,7,6],[5,26,8,30],[20,2,23,3]]}
[null,null,"NOTA DE DEBITO",{"$nulls":23},{"$f":"MENU!C1","v":"NOMBRE DE LA EMPRESA X"}]
[null,null,"N_D",{"$f":"MAX(DIARIO!E2:E1000)+1","v":1},{"$nulls":3},"PLAN DE CUENTAS"]
[null,null,"NOTA DEBIT. Nº:",null,"FECHA:",{"$nulls":21},{"$f":"C1","v":"NOTA DE DEBITO"}]
[{"$nulls":29},"ASI Nº:",{"$f":"D3","v":0}]
[null,null,"CONCEPTO:",{"$nulls":23},"CONCEPTO:",null,null,"FECHA:",{"$f":"F3","v":"00:00:00"}]
[{"$nulls":26},{"$f":"C6","v":0}]
[]
[]
[null,null,"CODIGO","DESCRIPCION","DEBE","HABER","DETALLES"]
[{"$nulls":3},{"$f":"IF(C10<>\"\",VLOOKUP(C10,PLAN,2,0),\"\")","v":""},{"$nulls":22},"CODIGO","DESCRIPCION","DEBE","HABER","DETALLES"]
[{"$nulls":3},""]
[{"$nulls":3},""]
[{"$nulls":3},""]
[{"$nulls":3},""]
[{"$nulls":3},""]
[{"$nulls":3},""]
[{"$nulls":3},""]
[{"$nulls":3},""]
[{"$nulls":3},"HAZ CLIC EN EL BONTON\n NUEVA LINEA"]
[null,null,"NOTAS:","TOTAL",{"$f":"SUM(E10:E19)","v":0},{"$f":"SUM(F10:F19)","v":0},{"$f":"IF(F21<>0,\"OJO ASIENTO NO CUADRA\",\"\")","v":""}]
[{"$nulls":5},{"$f":"E20-F20","v":0}]
{"$rows_empty":34}
[{"$nulls":27},"SUMAN",{"$f":"SUM(AC11:AC55)","v":0},{"$f":"SUM(AD11:AD55)","v":0}]
[]
[]
[]
[]
[{"$nulls":26},"               ELABORADO POR",null,"RIVISADO POR",null,"AUTORIZADO POR"]

{"sheet":"NC","index":5,"n_rows":61,"n_cols":31,"rows_kept":61,"merged":[[0,2,0,6],[0,26,0,30],[1,7,1,11],[2,26,2,30],[5,2,7,6],[5,26,8,30],[20,2,23,3]]}
[null,null,"NOTA DE CREDITO",{"$nulls":23},{"$f":"MENU!C1","v":"NOMBRE DE LA EMPRESA X"}]
[null,null,"N_C",{"$f":"MAX(DIARIO!F2:F1000)+1","v":1},{"$nulls":3},"PLAN DE CUENTAS"]
[null,null,"NOTA CREDTI. Nº:",null,"FECHA:",{"$nulls":21},{"$f":"C1","v":"NOTA DE CREDITO"}]
[{"$nulls":29},"ASI Nº:",{"$f":"D3","v":0}]
[null,null,"CONCEPTO:",{"$nulls":23},"CONCEPTO:",null,null,"FECHA:",{"$f":"F3","v":"00:00:00"}]
[{"$nulls":26},{"$f":"C6","v":0}]
[]
[]
[null,null,"CODIGO","DESCRIPCION","DEBE","HABER","DETALLES"]
[{"$nulls":3},{"$f":"IF(C10<>\"\",VLOOKUP(C10,PLAN,2,0),\"\")","v":""},{"$nulls":22},"CODIGO","DESCRIPCION","DEBE","HABER","DETALLES"]
[{"$nulls":3},""]
[{"$nulls":3},""]
[{"$nulls":3},""]
[{"$nulls":3},""]
[{"$nulls":3},""]
[{"$nulls":3},""]
[{"$nulls":3},""]
[{"$nulls":3},""]
[{"$nulls":3},"HAZ CLIC EN EL BONTON\n NUEVA LINEA"]
[null,null,"NOTAS:","TOTAL",{"$f":"SUM(E10:E19)","v":0},{"$f":"SUM(F10:F19)","v":0},{"$f":"IF(F21<>0,\"OJO ASIENTO NO CUADRA\",\"\")","v":""}]
[{"$nulls":5},{"$f":"E20-F20","v":0}]
{"$rows_empty":34}
[{"$nulls":27},"SUMAN",{"$f":"SUM(AC11:AC55)","v":0},{"$f":"SUM(AD11:AD55)","v":0}]
[]
[]
[]
[]
[{"$nulls":26},"               ELABORADO POR",null,"RIVISADO POR",null,"AUTORIZADO POR"]

{"sheet":"DIARIO","index":6,"n_rows":9,"n_cols":12,"rows_kept":9}
["FECHA","ASI Nº","ING. Nº","EGR Nº","ND Nº","NC Nº","CODIGO","CUENTAS","DESCRIPCION","DEBE","HABER","DETALLES"]
["2013-09-22",null,1,{"$nulls":3},"1.1.1.1.001","CAJA GENERAL","APERTURA",{"v":15000,"d":"15,000.00 "},null,"CARLOS WILSON"]
["2013-09-22",null,1,{"$nulls":3},"3.1.1.1.001","CAPITAL NEGOCIO X","APERTURA",null,{"v":15000,"d":"15,000.00 "},"CARLOS WILSON"]
["2012-02-01",1,{"$nulls":4},"1.1.1.2.001","EMPRESA X  CTA.CTE.#10012705215805","DEPOSITO",{"v":15000,"d":"15,000.00 "}]
["2012-02-01",1,{"$nulls":4},"1.1.1.1.001","CAJA GENERAL","DEPOSITO",null,{"v":15000,"d":"15,000.00 "}]
["2013-02-20",null,null,1,null,null,"1.3.2.1.001","INMUEBLES ENTREGADOS EN GARANTIA","PAGO POR 9 QQ DE ARROZ A 800 C/U.",{"v":7200,"d":"7,200.00 "}]
["2013-02-20",null,null,1,null,null,"1.1.1.2.001","EMPRESA X  CTA.CTE.#10012705215805","PAGO POR 9 QQ DE ARROZ A 800 C/U.",null,{"v":7200,"d":"7,200.00 "}]
["2012-02-01",2,{"$nulls":4},"1.1.2.1.002","CUENTAS POR COBRAR EMPLEADOS","PRUEBA",{"v":500,"d":"500.00 "},null,"ALEX CARRILLO"]
["2012-02-01",2,{"$nulls":4},"1.1.1.1.001","CAJA GENERAL","PRUEBA",null,{"v":500,"d":"500.00 "},"ALEX CARRILLO"]

{"sheet":"MAYOR","index":7,"n_rows":206,"n_cols":11,"rows_kept":206,"hidden":true,"merged":[[1,1,1,5],[3,0,3,10],[5,0,5,10]]}
[]
["FECHA:",{"$f":"TODAY()","v":"2014-03-13"}]
[]
[{"$f":"MENU!C1","v":"NOMBRE DE LA EMPRESA X"}]
[]
["MAYOR GENERAL"]
[{"$nulls":6},"CUENTA:",{"$f":"IF(MENU!G16<>\"\",VLOOKUP(MENU!G16,PLAN,1,0),\"\")","v":"1.1.1.1.002"},{"$f":"IF(MENU!G16<>\"\",VLOOKUP(MENU!G16,PLAN,2,0),\"\")","v":"CAJA CHICA"}]
[]
["FECHA","ASI Nº","ING Nº","EGR Nº ","ND Nº","NC Nº","CODIGO","DESCRIPCION","DEBE","HABER","SALDOS"]
[{"$nulls":10},{"$f":"I10-J10","v":0}]
[{"$nulls":10},{"$f":"IF((I11-J11)<>0,(I11-J11+K10),\"\")","v":""}]
[{"$nulls":10},{"$f":"IF((I12-J12)<>0,(I12-J12+K11),\"\")","v":""}]
[{"$nulls":10},""]
[{"$nulls":10},""]
[{"$nulls":10},""]
[{"$nulls":10},""]
[{"$nulls":10},""]
[{"$nulls":10},""]
[{"$nulls":10},""]
[{"$nulls":10},""]
[{"$nulls":10},""]
[{"$nulls":10},""]
[{"$nulls":10},""]
[{"$nulls":10},""]
[{"$nulls":10},""]
[{"$nulls":10},""]
[{"$nulls":10},""]
[{"$nulls":10},""]
[{"$nulls":10},""]
[{"$nulls":10},""]
[{"$nulls":10},""]
[{"$nulls":10},""]
[{"$nulls":10},""]
[{"$nulls":10},""]
[{"$nulls":10},""]
[{"$nulls":10},""]
[{"$nulls":10},""]
[{"$nulls":10},""]
[{"$nulls":10},""]
[{"$nulls":10},""]
{"$rows_left_out":167}
{"sheet":"BALANCE","index":8,"n_rows":159,"n_cols":22,"rows_kept":159,"merged":[[0,0,0,5],[2,0,2,5],[6,2,6,3],[6,4,6,5]]}
[{"$f":"MENU!C1","v":"NOMBRE DE LA EMPRESA X"}]
[]
["BALANCE DE COMPROBACION"]
[]
["FECHA:",{"$f":"TODAY()","v":"2014-03-13"}]
[]
[null,null,"MOVIMIENTOS",null,"SALDOS"]
["CODIGO","CUENTAS","DEBITOS","CREDITOS","DEUDOR","ACREEDOR"]
[]
["1.","ACTIVO",{"$f":"SUM(IF(CodigoD=CodigoB,1,0)*DEBE)","v":0},{"$f":"SUM(IF(CodigoD=CodigoB,1,0)*HABER)","v":0},{"$f":"IF(C10>D10,C10-D10,\"\")","v":""},{"$f":"IF(C10<D10,D10-C10,\"\")","v":""},{"$nulls":15},{"$f":"A10&\"                    \"&B10","v":"1.                    ACTIVO"}]
["1.1.","ACTIVOS CIRCULANTES",{"$f":"SUM(IF(CodigoD=CodigoB,1,0)*DEBE)","v":0},{"$f":"SUM(IF(CodigoD=CodigoB,1,0)*HABER)","v":0},{"$f":"IF(C11>D11,C11-D11,\"\")","v":""},{"$f":"IF(C11<D11,D11-C11,\"\")","v":""},{"$nulls":15},{"$f":"A11&\"                \"&B11","v":"1.1.                ACTIVOS CIRCULANTES"}]
["1.1.1.","ACTIVOS DISPONIBLES",{"$f":"SUM(IF(CodigoD=CodigoB,1,0)*DEBE)","v":0},{"$f":"SUM(IF(CodigoD=CodigoB,1,0)*HABER)","v":0},"","",{"$nulls":15},{"$f":"A12&\"            \"&B12","v":"1.1.1.            ACTIVOS DISPONIBLES"}]
["1.1.1.1.","CAJA",{"$f":"SUM(IF(CodigoD=CodigoB,1,0)*DEBE)","v":0},{"$f":"SUM(IF(CodigoD=CodigoB,1,0)*HABER)","v":0},"","",{"$nulls":15},{"$f":"A13&\"        \"&B13","v":"1.1.1.1.        CAJA"}]
["1.1.1.1.001","CAJA GENERAL",{"$f":"SUM(IF(CodigoD=CodigoB,1,0)*DEBE)","v":{"v":15000,"d":"15,000.00 "}},{"$f":"SUM(IF(CodigoD=CodigoB,1,0)*HABER)","v":{"v":15500,"d":"15,500.00 "}},"",{"v":500,"d":"500.00 "},{"$nulls":15},{"$f":"A14&\"  \"&B14","v":"1.1.1.1.001  CAJA GENERAL"}]
["1.1.1.1.002","CAJA CHICA",{"$f":"SUM(IF(CodigoD=CodigoB,1,0)*DEBE)","v":0},{"$f":"SUM(IF(CodigoD=CodigoB,1,0)*HABER)","v":0},"","",{"$nulls":15},{"$f":"A15&\"  \"&B15","v":"1.1.1.1.002  CAJA CHICA"}]
["1.1.1.2.","BANCOS",{"$f":"SUM(IF(CodigoD=CodigoB,1,0)*DEBE)","v":0},{"$f":"SUM(IF(CodigoD=CodigoB,1,0)*HABER)","v":0},"","",{"$nulls":15},{"$f":"A16&\"         \"&B16","v":"1.1.1.2.         BANCOS"}]
["1.1.1.2.001","EMPRESA X  CTA.CTE.#10012705215805",{"$f":"SUM(IF(CodigoD=CodigoB,1,0)*DEBE)","v":{"v":15000,"d":"15,000.00 "}},{"$f":"SUM(IF(CodigoD=CodigoB,1,0)*HABER)","v":{"v":7200,"d":"7,200.00 "}},{"v":7800,"d":"7,800.00 "},"",{"$nulls":15},{"$f":"A17&\"  \"&B17","v":"1.1.1.2.001  EMPRESA X  CTA.CTE.#10012705215805"}]
["1.1.2.","ACTIVOS EXIGIBLES",{"$f":"SUM(IF(CodigoD=CodigoB,1,0)*DEBE)","v":0},{"$f":"SUM(IF(CodigoD=CodigoB,1,0)*HABER)","v":0},"","",{"$nulls":15},{"$f":"A18&\"             \"&B18","v":"1.1.2.             ACTIVOS EXIGIBLES"}]
["1.1.2.1.","CUENTAS POR COBRAR",{"$f":"SUM(IF(CodigoD=CodigoB,1,0)*DEBE)","v":0},{"$f":"SUM(IF(CodigoD=CodigoB,1,0)*HABER)","v":0},"","",{"$nulls":15},{"$f":"A19&\"         \"&B19","v":"1.1.2.1.         CUENTAS POR COBRAR"}]
["1.1.2.1.001","CUENTAS POR COBRAR CLIENTES",{"$f":"SUM(IF(CodigoD=CodigoB,1,0)*DEBE)","v":0},{"$f":"SUM(IF(CodigoD=CodigoB,1,0)*HABER)","v":0},"","",{"$nulls":15},{"$f":"A20&\"  \"&B20","v":"1.1.2.1.001  CUENTAS POR COBRAR CLIENTES"}]
["1.1.2.1.002","CUENTAS POR COBRAR EMPLEADOS",{"$f":"SUM(IF(CodigoD=CodigoB,1,0)*DEBE)","v":{"v":500,"d":"500.00 "}},{"$f":"SUM(IF(CodigoD=CodigoB,1,0)*HABER)","v":0},{"v":500,"d":"500.00 "},"",{"$nulls":15},{"$f":"A21&\"  \"&B21","v":"1.1.2.1.002  CUENTAS POR COBRAR EMPLEADOS"}]
["1.1.2.1.003","CUENTAS POR COBRAR OTROS",{"$f":"SUM(IF(CodigoD=CodigoB,1,0)*DEBE)","v":0},{"$f":"SUM(IF(CodigoD=CodigoB,1,0)*HABER)","v":0},"","",{"$nulls":15},"1.1.2.1.003  CUENTAS POR COBRAR OTROS"]
["1.1.2.1.004","ANTICIPO A JUSTIFICAR",{"$f":"SUM(IF(CodigoD=CodigoB,1,0)*DEBE)","v":0},{"$f":"SUM(IF(CodigoD=CodigoB,1,0)*HABER)","v":0},"","",{"$nulls":15},"1.1.2.1.004  ANTICIPO A JUSTIFICAR"]
["1.1.3.","ACTIVOS REALIZABLES",{"$f":"SUM(IF(CodigoD=CodigoB,1,0)*DEBE)","v":0},{"$f":"SUM(IF(CodigoD=CodigoB,1,0)*HABER)","v":0},"","",{"$nulls":15},{"$f":"A24&\"             \"&B24","v":"1.1.3.             ACTIVOS REALIZABLES"}]
["1.1.3.1.","INVENTARIO DE MATERIALES",{"$f":"SUM(IF(CodigoD=CodigoB,1,0)*DEBE)","v":0},{"$f":"SUM(IF(CodigoD=CodigoB,1,0)*HABER)","v":0},"","",{"$nulls":15},{"$f":"A25&\"         \"&B25","v":"1.1.3.1.         INVENTARIO DE MATERIALES"}]
["1.1.3.1.001","INV. DE ACCESORIOS",{"$f":"SUM(IF(CodigoD=CodigoB,1,0)*DEBE)","v":0},{"$f":"SUM(IF(CodigoD=CodigoB,1,0)*HABER)","v":0},"","",{"$nulls":15},{"$f":"A26&\"  \"&B26","v":"1.1.3.1.001  INV. DE ACCESORIOS"}]
["1.1.3.1.002","INV. DE PAPERIA Y UTILES  DE OFICINA",{"$f":"SUM(IF(CodigoD=CodigoB,1,0)*DEBE)","v":0},{"$f":"SUM(IF(CodigoD=CodigoB,1,0)*HABER)","v":0},"","",{"$nulls":15},{"$f":"A27&\"  \"&B27","v":"1.1.3.1.002  INV. DE PAPERIA Y UTILES  DE OFICINA"}]
["1.1.3.1.003","INV. DE MATERIALES Y LIMPIEZA",{"$f":"SUM(IF(CodigoD=CodigoB,1,0)*DEBE)","v":0},{"$f":"SUM(IF(CodigoD=CodigoB,1,0)*HABER)","v":0},"","",{"$nulls":15},"1.1.3.1.003  INV. DE MATERIALES Y LIMPIEZA"]
["1.1.3.2.","INVENTARIO DE MERCADERIAS",{"$f":"SUM(IF(CodigoD=CodigoB,1,0)*DEBE)","v":0},{"$f":"SUM(IF(CodigoD=CodigoB,1,0)*HABER)","v":0},"","",{"$nulls":15},{"$f":"A29&\"         \"&B29","v":"1.1.3.2.         INVENTARIO DE MERCADERIAS"}]
["1.1.3.2.001","GRANOS BASICOS",{"$f":"SUM(IF(CodigoD=CodigoB,1,0)*DEBE)","v":0},{"$f":"SUM(IF(CodigoD=CodigoB,1,0)*HABER)","v":0},"","",{"$nulls":15},{"$f":"A30&\"  \"&B30","v":"1.1.3.2.001  GRANOS BASICOS"}]
["1.1.4.","OTROS ACTIVOS CIRCULANTES",{"$f":"SUM(IF(CodigoD=CodigoB,1,0)*DEBE)","v":0},{"$f":"SUM(IF(CodigoD=CodigoB,1,0)*HABER)","v":0},"","",{"$nulls":15},{"$f":"A31&\"             \"&B31","v":"1.1.4.             OTROS ACTIVOS CIRCULANTES"}]
["1.1.4.1.","IMPUESTOS ANTICIPADOS Y RETENIDOS",{"$f":"SUM(IF(CodigoD=CodigoB,1,0)*DEBE)","v":0},{"$f":"SUM(IF(CodigoD=CodigoB,1,0)*HABER)","v":0},"","",{"$nulls":15},{"$f":"A32&\"         \"&B32","v":"1.1.4.1.         IMPUESTOS ANTICIPADOS Y RETENIDOS"}]
["1.1.4.1.001","IVA CREDITO TRIBUNAL",{"$f":"SUM(IF(CodigoD=CodigoB,1,0)*DEBE)","v":0},{"$f":"SUM(IF(CodigoD=CodigoB,1,0)*HABER)","v":0},"","",{"$nulls":15},{"$f":"A33&\"  \"&B33","v":"1.1.4.1.001  IVA CREDITO TRIBUNAL"}]
["1.1.4.1.002","ANTICIPO IMPUESTO A LA RENTA",{"$f":"SUM(IF(CodigoD=CodigoB,1,0)*DEBE)","v":0},{"$f":"SUM(IF(CodigoD=CodigoB,1,0)*HABER)","v":0},"","",{"$nulls":15},{"$f":"A34&\"  \"&B34","v":"1.1.4.1.002  ANTICIPO IMPUESTO A LA RENTA"}]
["1.1.4.1.003","ANTICIPO RETENCION EN LA FUENTE",{"$f":"SUM(IF(CodigoD=CodigoB,1,0)*DEBE)","v":0},{"$f":"SUM(IF(CodigoD=CodigoB,1,0)*HABER)","v":0},"","",{"$nulls":15},"1.1.4.1.003  ANTICIPO RETENCION EN LA FUENTE"]
["1.2.","ACTIVOS FIJOS",{"$f":"SUM(IF(CodigoD=CodigoB,1,0)*DEBE)","v":0},{"$f":"SUM(IF(CodigoD=CodigoB,1,0)*HABER)","v":0},"","",{"$nulls":15},{"$f":"A36&\"                 \"&B36","v":"1.2.                 ACTIVOS FIJOS"}]
["1.2.1.","ACTIVOS TANGIBLES",{"$f":"SUM(IF(CodigoD=CodigoB,1,0)*DEBE)","v":0},{"$f":"SUM(IF(CodigoD=CodigoB,1,0)*HABER)","v":0},"","",{"$nulls":15},{"$f":"A37&\"             \"&B37","v":"1.2.1.             ACTIVOS TANGIBLES"}]
["1.2.1.1.","ACTIVOS DEPRECIABLES",{"$f":"SUM(IF(CodigoD=CodigoB,1,0)*DEBE)","v":0},{"$f":"SUM(IF(CodigoD=CodigoB,1,0)*HABER)","v":0},"","",{"$nulls":15},{"$f":"A38&\"         \"&B38","v":"1.2.1.1.         ACTIVOS DEPRECIABLES"}]
["1.2.1.1.001","INMUEBLES",{"$f":"SUM(IF(CodigoD=CodigoB,1,0)*DEBE)","v":0},{"$f":"SUM(IF(CodigoD=CodigoB,1,0)*HABER)","v":0},"","",{"$nulls":15},{"$f":"A39&\"  \"&B39","v":"1.2.1.1.001  INMUEBLES"}]
["1.2.1.1.002","INSTALACIONES",{"$f":"SUM(IF(CodigoD=CodigoB,1,0)*DEBE)","v":0},{"$f":"SUM(IF(CodigoD=CodigoB,1,0)*HABER)","v":0},"","",{"$nulls":15},{"$f":"A40&\"  \"&B40","v":"1.2.1.1.002  INSTALACIONES"}]
{"$rows_left_out":120}
{"sheet":"GENERAL","index":9,"n_rows":119,"n_cols":4,"rows_kept":119,"hidden":true,"merged":[[0,0,0,3],[2,0,2,3]]}
[{"$f":"MENU!C1","v":"NOMBRE DE LA EMPRESA X"}]
[]
["BALANCE GENERAL"]
[]
["AL",{"$f":"TODAY()","v":"2014-03-13"}]
[]
["CODIGO","CUENTAS","DEBE","HABER"]
[{"$f":"BALANCE!A10","v":"1."},{"$f":"BALANCE!B10","v":"ACTIVO"}]
[{"$f":"BALANCE!A11","v":"1.1."},{"$f":"BALANCE!B11","v":"ACTIVOS CIRCULANTES"}]
[{"$f":"BALANCE!A12","v":"1.1.1."},{"$f":"BALANCE!B12","v":"ACTIVOS DISPONIBLES"}]
[{"$f":"BALANCE!A13","v":"1.1.1.1."},{"$f":"BALANCE!B13","v":"CAJA"}]
[{"$f":"BALANCE!A14","v":"1.1.1.1.001"},{"$f":"BALANCE!B14","v":"CAJA GENERAL"}]
[{"$f":"BALANCE!A15","v":"1.1.1.1.002"},{"$f":"BALANCE!B15","v":"CAJA CHICA"}]
[{"$f":"BALANCE!A16","v":"1.1.1.2."},{"$f":"BALANCE!B16","v":"BANCOS"}]
[{"$f":"BALANCE!A17","v":"1.1.1.2.001"},{"$f":"BALANCE!B17","v":"EMPRESA X  CTA.CTE.#10012705215805"}]
[{"$f":"BALANCE!A18","v":"1.1.2."},{"$f":"BALANCE!B18","v":"ACTIVOS EXIGIBLES"}]
[{"$f":"BALANCE!A19","v":"1.1.2.1."},{"$f":"BALANCE!B19","v":"CUENTAS POR COBRAR"}]
[{"$f":"BALANCE!A20","v":"1.1.2.1.001"},{"$f":"BALANCE!B20","v":"CUENTAS POR COBRAR CLIENTES"}]
[{"$f":"BALANCE!A21","v":"1.1.2.1.002"},{"$f":"BALANCE!B21","v":"CUENTAS POR COBRAR EMPLEADOS"}]
[{"$f":"BALANCE!A22","v":"1.1.2.1.003"},{"$f":"BALANCE!B22","v":"CUENTAS POR COBRAR OTROS"}]
[{"$f":"BALANCE!A23","v":"1.1.2.1.004"},{"$f":"BALANCE!B23","v":"ANTICIPO A JUSTIFICAR"}]
[{"$f":"BALANCE!A24","v":"1.1.3."},{"$f":"BALANCE!B24","v":"ACTIVOS REALIZABLES"}]
[{"$f":"BALANCE!A25","v":"1.1.3.1."},{"$f":"BALANCE!B25","v":"INVENTARIO DE MATERIALES"}]
[{"$f":"BALANCE!A26","v":"1.1.3.1.001"},{"$f":"BALANCE!B26","v":"INV. DE ACCESORIOS"}]
[{"$f":"BALANCE!A27","v":"1.1.3.1.002"},{"$f":"BALANCE!B27","v":"INV. DE PAPERIA Y UTILES  DE OFICINA"}]
[{"$f":"BALANCE!A28","v":"1.1.3.1.003"},{"$f":"BALANCE!B28","v":"INV. DE MATERIALES Y LIMPIEZA"}]
[{"$f":"BALANCE!A29","v":"1.1.3.2."},{"$f":"BALANCE!B29","v":"INVENTARIO DE MERCADERIAS"}]
[{"$f":"BALANCE!A30","v":"1.1.3.2.001"},{"$f":"BALANCE!B30","v":"GRANOS BASICOS"}]
[{"$f":"BALANCE!A31","v":"1.1.4."},{"$f":"BALANCE!B31","v":"OTROS ACTIVOS CIRCULANTES"}]
[{"$f":"BALANCE!A32","v":"1.1.4.1."},{"$f":"BALANCE!B32","v":"IMPUESTOS ANTICIPADOS Y RETENIDOS"}]
[{"$f":"BALANCE!A33","v":"1.1.4.1.001"},{"$f":"BALANCE!B33","v":"IVA CREDITO TRIBUNAL"}]
[{"$f":"BALANCE!A34","v":"1.1.4.1.002"},{"$f":"BALANCE!B34","v":"ANTICIPO IMPUESTO A LA RENTA"}]
[{"$f":"BALANCE!A35","v":"1.1.4.1.003"},{"$f":"BALANCE!B35","v":"ANTICIPO RETENCION EN LA FUENTE"}]
[{"$f":"BALANCE!A36","v":"1.2."},{"$f":"BALANCE!B36","v":"ACTIVOS FIJOS"}]
[{"$f":"BALANCE!A37","v":"1.2.1."},{"$f":"BALANCE!B37","v":"ACTIVOS TANGIBLES"}]
[{"$f":"BALANCE!A38","v":"1.2.1.1."},{"$f":"BALANCE!B38","v":"ACTIVOS DEPRECIABLES"}]
[{"$f":"BALANCE!A39","v":"1.2.1.1.001"},{"$f":"BALANCE!B39","v":"INMUEBLES"}]
[{"$f":"BALANCE!A40","v":"1.2.1.1.002"},{"$f":"BALANCE!B40","v":"INSTALACIONES"}]
[{"$f":"BALANCE!A41","v":"1.2.1.2."},{"$f":"BALANCE!B41","v":"ACTIVOS NO DEPRECIABLES"}]
[{"$f":"BALANCE!A42","v":"1.2.1.2.001"},{"$f":"BALANCE!B42","v":"TERRENO # 1"}]
{"$rows_left_out":80}
{"sheet":"RESULTADO","index":10,"n_rows":50,"n_cols":4,"rows_kept":50,"hidden":true,"merged":[[0,0,0,3],[2,0,2,3]]}
[{"$f":"MENU!C1","v":"NOMBRE DE LA EMPRESA X"}]
[]
["BALANCE DE RESULTADO"]
[]
["AL",{"$f":"TODAY()","v":"2014-03-13"}]
[]
["CODIGO","CUENTAS","DEBE","HABER"]
[{"$f":"BALANCE!A119","v":"4."},{"$f":"BALANCE!B119","v":"INGRESOS"}]
[{"$f":"BALANCE!A120","v":"4.1."},{"$f":"BALANCE!B120","v":"INGRESOS OPERACIONALES"}]
[{"$f":"BALANCE!A121","v":"4.1.1."},{"$f":"BALANCE!B121","v":"VENTAS GENERALES"}]
[{"$f":"BALANCE!A122","v":"4.1.1.1."},{"$f":"BALANCE!B122","v":"VENTAS NETAS"}]
[{"$f":"BALANCE!A123","v":"4.1.1.1.001"},{"$f":"BALANCE!B123","v":"VENTAS DE GRANOS BASICOS"}]
[{"$f":"BALANCE!A124","v":"5."},{"$f":"BALANCE!B124","v":"COSTOS"}]
[{"$f":"BALANCE!A125","v":"5.1."},{"$f":"BALANCE!B125","v":"COSTOS OPERACIONALES"}]
[{"$f":"BALANCE!A126","v":"5.1.1."},{"$f":"BALANCE!B126","v":"COSTO DE VENTA"}]
[{"$f":"BALANCE!A127","v":"5.1.1.1."},{"$f":"BALANCE!B127","v":"COSTOS DE VENTAS GRANOS BASICO"}]
[{"$f":"BALANCE!A128","v":"5.1.1.1.001"},{"$f":"BALANCE!B128","v":"COSTO GRANOS BASICO"}]
[{"$f":"BALANCE!A129","v":"6."},{"$f":"BALANCE!B129","v":"GASTOS"}]
[{"$f":"BALANCE!A130","v":"6.1."},{"$f":"BALANCE!B130","v":"GASTOS OPERACIONALES"}]
[{"$f":"BALANCE!A131","v":"6.1.1."},{"$f":"BALANCE!B131","v":"GASTOS DE ADMINISTRACION"}]
[{"$f":"BALANCE!A132","v":"6.1.1.1."},{"$f":"BALANCE!B132","v":"SUELDOS Y SIMILARES ADMON"}]
[{"$f":"BALANCE!A133","v":"6.1.1.1.001"},{"$f":"BALANCE!B133","v":"SUELDOS Y SALARIOS ADMON"}]
[{"$f":"BALANCE!A134","v":"6.1.1.1.002"},{"$f":"BALANCE!B134","v":"COMPONENTE SALARIAL ADM"}]
[{"$f":"BALANCE!A135","v":"6.1.1.1.003"},{"$f":"BALANCE!B135","v":"HORA EXTRA ADM"}]
[{"$f":"BALANCE!A136","v":"6.1.2."},{"$f":"BALANCE!B136","v":"GASTOS DE VENTAS"}]
[{"$f":"BALANCE!A137","v":"6.1.2.1."},{"$f":"BALANCE!B137","v":"SUELDOS Y SIMILARES"}]
[{"$f":"BALANCE!A138","v":"6.1.2.1.001"},{"$f":"BALANCE!B138","v":"SUELDOS Y SALARIOS DE VENTAS"}]
[{"$f":"BALANCE!A139","v":"6.1.2.1.002"},{"$f":"BALANCE!B139","v":"COMPROBANTE SALARIAL DE VTA"}]
[{"$f":"BALANCE!A140","v":"6.1.2.1.003"},{"$f":"BALANCE!B140","v":"HORAS EXTRAS VTAS"}]
[{"$f":"BALANCE!A141","v":"6.1.3."},{"$f":"BALANCE!B141","v":"GASTOS FINANCIEROS"}]
[{"$f":"BALANCE!A142","v":"6.1.3.1."},{"$f":"BALANCE!B142","v":"GASTOS BANCARIOS"}]
[{"$f":"BALANCE!A143","v":"6.1.3.1.001"},{"$f":"BALANCE!B143","v":"GTOS BANC.X CHEQUERA"}]
[{"$f":"BALANCE!A144","v":"6.1.3.1.002"},{"$f":"BALANCE!B144","v":"GAST.X SERV.BANC."}]
[{"$f":"BALANCE!A145","v":"6.1.3.1.003"},{"$f":"BALANCE!B145","v":"GAST. X DEVALUACION DE LA MONEDA FIN."}]
[{"$f":"BALANCE!A146","v":"6.1.4."},{"$f":"BALANCE!B146","v":"GASTOS GENERALES"}]
[{"$f":"BALANCE!A147","v":"6.1.4.1."},{"$f":"BALANCE!B147","v":"MANTENIMIENTO DE MUEBLES Y ENSERES GEN"}]
[{"$f":"BALANCE!A148","v":"6.1.4.1.001"},{"$f":"BALANCE!B148","v":"MANT. DE MUEBLES GEN"}]
[{"$f":"BALANCE!A149","v":"6.1.4.1.002"},{"$f":"BALANCE!B149","v":"MANT. DE ENSERES GEN"}]
[{"$f":"BALANCE!A150","v":"6.1.4.2."},{"$f":"BALANCE!B150","v":"CONS. DE ENEGIA ELECTRICA GEN"}]
[{"$f":"BALANCE!A151","v":"6.1.4.2.01"},{"$f":"BALANCE!B151","v":"CONS.ENEGIA ENEL GEN"}]
{"$rows_left_out":11}
{"sheet":"Hoja1","index":11,"n_rows":70,"n_cols":1,"rows_kept":70,"hidden":true}
["1.1.1.1.001"]
["1.1.1.1.002"]
["1.1.1.2.001"]
["1.1.2.1.001"]
["1.1.2.1.002"]
["1.1.2.1.003"]
["1.1.2.1.004"]
["1.1.3.1.001"]
["1.1.3.1.002"]
["1.1.3.1.003"]
["1.1.3.2.001"]
["1.1.4.1.001"]
["1.1.4.1.002"]
["1.1.4.1.003"]
["1.2.1.1.001"]
["1.2.1.1.002"]
["1.2.1.2.001"]
["1.2.1.3.001"]
["1.2.1.3.002"]
["1.2.2.1.001"]
["1.2.2.1.002"]
["1.2.2.2.001"]
["1.3.1.1.001"]
["1.3.2.1.001"]
["2.1.1.1.001"]
["2.1.1.2.001"]
["2.1.1.3.001"]
["2.1.1.3.002"]
["2.1.1.4.001"]
["2.1.2.1.001"]
["2.1.2.1.002"]
["2.1.2.1.003"]
["2.1.2.2.001"]
["2.1.2.2.002"]
["2.1.2.3.001"]
["2.1.2.3.002"]
["2.1.2.3.003"]
["2.1.3.1.001"]
["2.1.3.1.002"]
["2.1.3.2.001"]
{"$rows_left_out":30}