{"text_format":"1","workbook":"xlsx","n_sheets":12,"sheets":["MENU","F.COMPRA","F.VENTA","BASE","PRODUCTOS","K","E","P","CLIENTES","PROVEEDORES","RESUMEN","COSTO C."],"not_rendered":{"charts":0,"images":7,"macros":1,"external_links":1,"defined_names":39,"comments":0,"pivot_tables":0},"unopened":[],"bounds":{"document_bytes":16777216,"sheet_cells":100000,"rows_first":2000,"rows_last":500,"rows_between":2000,"halvings":0,"cell_chars":16384,"cell_head_chars":4096},"cells_cut":0,"cells_raw":0,"read":"whole","date_system":"1900"}

{"sheet":"MENU","index":0,"n_rows":23,"n_cols":12,"rows_kept":23,"cut":false,"hidden":false,"merged":[[18,3,18,5],[20,3,20,5],[22,3,22,5],[0,11,0,13],[16,3,16,5],[0,2,0,4],[0,5,0,7],[0,8,0,10]]}
[null,null,"FACTURACION",null,null,"REPORTES",null,null,"PRESENTAR",null,null,"CONFIGURACIONES"]
[]
[]
[]
[]
[]
[]
[]
[]
[]
[]
[]
[]
[]
[]
[]
[null,null,null,"ULTIMO Nº FACT. VTA PER. ANTERIOR",null,null,4000]
[]
[null,null,null,"DIGITE EL CODIGO DEL PRODUCTO",null,null,1002]
[]
[null,null,null,"SELECCIONE EL NOMBRE DEL CLIENTE",null,null,"CARLOS PEREZ ESTRELLA"]
[]
[null,null,null,"SELECCIONE EL NOMBRE PROVEEDOR",null,null,"DISTRIBUIDORA LACTEOS S.A."]

{"sheet":"F.COMPRA","index":1,"n_rows":31,"n_cols":24,"rows_kept":31,"cut":false,"hidden":false,"merged":[[0,0,0,5],[2,0,2,5],[4,1,4,3],[6,2,6,5],[7,2,7,5],[7,0,7,1],[6,0,6,1]]}
["NOMBRE DEL NEGOCIO",null,null,null,null,null,null,null,null,null,null,null,null,null,null,null,null,null,null,null,null,null,"ALCONTADO",0]
[null,null,null,null,null,null,null,null,null,null,null,null,null,null,null,null,null,null,null,null,null,null,"ALCREDITO",1]
["FACTURA DE COMPRAS"]
[null,null,null,null,"ESTADO:",null,{"$f":"IF(F4<>\"\",VLOOKUP(F4,ESTBASE,2,0),\"\")","v":""}]
["FECHA:",{"$f":"TODAY()","v":"2013-05-28"},null,null,"COD. CONT:",{"$f":"IF(G4<>0,VLOOKUP(C7,Proveedor,2,0),2000)","v":{"$error":"#N/A"}}]
[null,null,null,null,"Nº FACT:"]
["PROVEEDOR:"]
["DIRECCION:",null,{"$f":"IF(C7<>\"\",VLOOKUP(C7,Proveedor,3,0),\"\")","v":""}]
["CANT.","CODIGO","PRODUCTO","DESCRIPCION","COSTO","C. TOTAL"]
[null,null,{"$f":"IF(B10<>\"\",VLOOKUP(B10,CATALOGO,2,0),\"\")","v":""},null,null,{"$f":"A10*E10","v":0}]
[null,null,"",null,null,{"$f":"A11*E11","v":0}]
[null,null,"",null,null,0]
[null,null,"",null,null,0]
[null,null,"",null,null,0]
[null,null,"",null,null,0]
[null,null,"",null,null,0]
[null,null,"",null,null,0]
[null,null,"",null,null,0]
[null,null,"",null,null,0]
[null,null,"",null,null,0]
[null,null,"",null,null,0]
[null,null,"",null,null,0]
[null,null,"",null,null,0]
[null,null,"",null,null,0]
[null,null,"",null,null,0]
[null,null,"",null,null,0]
[null,null,"",null,null,0]
[null,null,null,null,"SUBTOTALES",{"$f":"SUM(F10:F27)","v":0}]
[null,null,null,null,"IVA 15%"]
[null,null,null,null,"DESCUENTO"]
[null,null,null,null,"TOTAL",{"$f":"F28+F29-F30","v":0}]

{"sheet":"F.VENTA","index":2,"n_rows":32,"n_cols":7,"rows_kept":32,"cut":false,"hidden":false,"merged":[[31,0,31,2],[0,0,0,5],[2,0,2,5],[4,1,4,3],[6,0,6,1],[6,2,6,5],[7,0,7,1],[7,2,7,5]]}
["NOMBRE DEL NEGOCIO"]
[]
["FACTURA DE VENTAS"]
[null,null,null,null,"ESTADO:",null,{"$f":"IF(F4<>\"\",VLOOKUP(F4,ESTBASE,2,0),\"\")","v":""}]
["FECHA:",{"$f":"TODAY()","v":"2013-05-28"},null,null,"COD. CONT:",{"$f":"IF(G4<>0,VLOOKUP(C7,CLIENTES,2,0),1000)","v":{"$error":"#N/A"}},"Nº FACT."]
[null,null,null,null,"Nº FACT:",{"$f":"MAX(BASE!C3:C200)+1","v":4006}]
["CLIENTE:"]
["DIRECCION:",null,{"$f":"IF(C7<>\"\",VLOOKUP(C7,CLIENTES,3,0),\"\")","v":""}]
["CANT.","CODIGO","PRODUCTO","DESCRIPCION","PRECIO","P. TOTAL"]
[null,null,{"$f":"IF(B10<>\"\",VLOOKUP(B10,CATALOGO,2,0),\"\")","v":""},null,{"$f":"IF(B10<>\"\",VLOOKUP(B10,CATALOGO,5,0),\"\")","v":""},{"$f":"IF(A10>0,A10*E10,\"\")","v":""}]
[null,null,"",null,"",{"$f":"IF(A11>0,A11*E11,\"\")","v":""}]
[null,null,"",null,"",""]
[null,null,"",null,"",""]
[null,null,"",null,"",""]
[null,null,"",null,"",""]
[null,null,"",null,"",""]
[null,null,"",null,"",""]
[null,null,"",null,"",""]
[null,null,"",null,"",""]
[null,null,"",null,"",""]
[null,null,"",null,"",""]
[null,null,"",null,"",""]
[null,null,"",null,"",""]
[null,null,"",null,"",""]
[null,null,"",null,"",""]
[null,null,"",null,"",""]
[null,null,"",null,"",""]
[null,null,null,null,"SUBTOTALES",{"$f":"SUM(F10:F27)","v":0}]
[null,null,null,null,"IVA 15%",{"$f":"F28*0.15","v":0}]
[null,null,null,null,"DESCUENTO"]
[null,null,null,null,"TOTAL",{"$f":"F28+F29-F30","v":0}]
["VENDIDO POR:"]

{"sheet":"BASE","index":3,"n_rows":200,"n_cols":21,"rows_kept":200,"cut":false,"hidden":false,"merged":[[0,17,1,17],[0,10,1,10],[0,11,1,11],[0,0,1,0],[0,7,1,7],[0,8,1,8],[0,9,1,9],[0,5,1,5],[0,6,1,6],[0,3,1,3],[0,4,1,4],[0,1,0,2],[0,12,0,13],[0,14,0,16]]}
["FECHA","Nº DE FACTURA",null,"CLIENTES","PROVEEDORES","ESTADO","COD.\nCONT.","CODIGO","PRODUCTO","DESCRIPCION","PREC-\nCOST","COSTO \nREAL","CANTIDADES",null,"VALORES",null,null,"ABONOS",null,null,{"$f":"MENU!G17","v":4000}]
[null,"COMPRA","VENTA",null,null,null,null,null,null,null,null,null,"ENTRADA","SALIDA","DEBE","HABER","COSTO TOTAL"]
[0,0,{"$f":"U1","v":4000},0,0,0,0,0,{"$f":"IF(H3<>\"\",VLOOKUP(H3,CATALOGO,2,0),\"\")","v":"ANULADO"},0,0,{"$f":"IF(H3<>\"\",VLOOKUP(H3,CATALOGO,4,0),0)","v":0},0,0,0,0,0,0]
["2013-05-25",null,4001,null,null,null,112001,1001,"ARROZ","VENTA",60,0,null,45,{"$f":"M4*K4","v":0},{"$f":"N4*K4","v":2700},{"$f":"N4*L4","v":0},600]
["2013-05-25",1001,null,null,null,null,2111001,1001,"ARROZ","CPRA",40,0,40,null,{"$f":"M5*K5","v":1600},{"$f":"N5*K5","v":0},0]
["2013-05-25",1,null,null,null,null,2111002,1001,"ARROZ","DEV /V",65,0,5,null,{"$f":"M6*K6","v":325},{"$f":"N6*K6","v":0},{"$f":"N6*L6","v":0},700]
["2013-05-25",1,null,null,null,null,112002,1001,"ARROZ","DEV/C",50,0,null,15,0,750,0]
["2013-05-28",null,4002,"CARLOS PEREZ ESTRELLA",null,0,1000,1001,"ARROZ",null,25,0,null,45,0,1125,0]
["2013-05-28",null,4003,"ROGER PEREZ BELLO",null,0,1000,1004,"HARINA",null,27,0,null,45,0,1215,0]
["2013-05-28",null,4004,"RIGO GARTH",null,0,1000,1004,"HARINA",null,27,0,null,50,0,1350,0]
["2013-05-28",50020,null,null,"TOYOTA MOTORS S.A.",0,2000,1001,"ARROZ","COMPRA",35,0,450,null,15750,0,0]
["2013-05-28",null,4005,"CARLOS SANDOBAL",null,1,112004,1001,"ARROZ","VENTA",30,0,null,150,0,4500,0]
[null,null,null,null,null,null,null,null,"",null,null,0,null,null,0,0,0]
[null,null,null,null,null,null,null,null,"",null,null,0,null,null,0,0,0]
[null,null,null,null,null,null,null,null,"",null,null,0,null,null,0,0,0]
[null,null,null,null,null,null,null,null,"",null,null,0,null,null,0,0,0]
[null,null,null,null,null,null,null,null,"",null,null,0,null,null,0,0,0]
[null,null,null,null,null,null,null,null,"",null,null,0,null,null,0,0,0]
[null,null,null,null,null,null,null,null,"",null,null,0,null,null,0,0,0]
[null,null,null,null,null,null,null,null,"",null,null,0,null,null,0,0,0]
[null,null,null,null,null,null,null,null,"",null,null,0,null,null,0,0,0]
[null,null,null,null,null,null,null,null,"",null,null,0,null,null,0,0,0]
[null,null,null,null,null,null,null,null,"",null,null,0,null,null,0,0,0]
[null,null,null,null,null,null,null,null,"",null,null,0,null,null,0,0,0]
[null,null,null,null,null,null,null,null,"",null,null,0,null,null,0,0,0]
[null,null,null,null,null,null,null,null,"",null,null,0,null,null,0,0,0]
[null,null,null,null,null,null,null,null,"",null,null,0,null,null,0,0,0]
[null,null,null,null,null,null,null,null,"",null,null,0,null,null,0,0,0]
[null,null,null,null,null,null,null,null,"",null,null,0,null,null,0,0,0]
[null,null,null,null,null,null,null,null,"",null,null,0,null,null,0,0,0]
[null,null,null,null,null,null,null,null,"",null,null,0,null,null,0,0,0]
[null,null,null,null,null,null,null,null,"",null,null,0,null,null,0,0,0]
[null,null,null,null,null,null,null,null,"",null,null,0,null,null,0,0,0]
[null,null,null,null,null,null,null,null,"",null,null,0,null,null,0,0,0]
[null,null,null,null,null,null,null,null,{"$f":"IF(H35<>\"\",VLOOKUP(H35,CATALOGO,2,0),\"\")","v":""},null,null,{"$f":"IF(H35<>\"\",VLOOKUP(H35,CATALOGO,4,0),0)","v":0},null,null,0,0,0]
[null,null,null,null,null,null,null,null,"",null,null,0,null,null,0,0,0]
[null,null,null,null,null,null,null,null,"",null,null,0,null,null,0,0,0]
[null,null,null,null,null,null,null,null,"",null,null,0,null,null,0,0,0]
[null,null,null,null,null,null,null,null,"",null,null,0,null,null,0,0,0]
[null,null,null,null,null,null,null,null,"",null,null,0,null,null,0,0,0]
[null,null,null,null,null,null,null,null,"",null,null,0,null,null,0,0,0]
[null,null,null,null,null,null,null,null,"",null,null,0,null,null,0,0,0]
[null,null,null,null,null,null,null,null,"",null,null,0,null,null,0,0,0]
[null,null,null,null,null,null,null,null,"",null,null,0,null,null,0,0,0]
[null,null,null,null,null,null,null,null,"",null,null,0,null,null,0,0,0]
[null,null,null,null,null,null,null,null,"",null,null,0,null,null,0,0,0]
[null,null,null,null,null,null,null,null,"",null,null,0,null,null,0,0,0]
[null,null,null,null,null,null,null,null,"",null,null,0,null,null,0,0,0]
[null,null,null,null,null,null,null,null,"",null,null,0,null,null,0,0,0]
[null,null,null,null,null,null,null,null,"",null,null,0,null,null,0,0,0]
[null,null,null,null,null,null,null,null,"",null,null,0,null,null,0,0,0]
[null,null,null,null,null,null,null,null,"",null,null,0,null,null,0,0,0]
[null,null,null,null,null,null,null,null,"",null,null,0,null,null,0,0,0]
[null,null,null,null,null,null,null,null,"",null,null,0,null,null,0,0,0]
[null,null,null,null,null,null,null,null,"",null,null,0,null,null,0,0,0]
[null,null,null,null,null,null,null,null,"",null,null,0,null,null,0,0,0]
[null,null,null,null,null,null,null,null,"",null,null,0,null,null,0,0,0]
[null,null,null,null,null,null,null,null,"",null,null,0,null,null,0,0,0]
[null,null,null,null,null,null,null,null,"",null,null,0,null,null,0,0,0]
[null,null,null,null,null,null,null,null,"",null,null,0,null,null,0,0,0]
{"$rows_left_out":141}
{"sheet":"PRODUCTOS","index":4,"n_rows":17,"n_cols":5,"rows_kept":17,"cut":false,"hidden":false,"merged":[[0,0,0,4],[2,0,2,4]]}
["NOMBRE DE LA EMPRESA"]
[]
["CATALOGO DE PRODUCTOS O ARTICULOS"]
[]
["COD. PROD","NOMBRE DEL ARTICULO","DESCRIPCION","COSTO R./U","PRECIO/U"]
[]
[0,"ANULADO"]
[1000,"GRANOS BASICOS"]
[1001,"ARROZ",null,{"$f":"'COSTO C.'!L7","v":0},30]
[1002,"AZUCAR",null,{"$f":"'COSTO C.'!L8","v":0},25]
[1003,"FRIJOLES",null,{"$f":"'COSTO C.'!L9","v":0},26]
[1004,"HARINA",null,{"$f":"'COSTO C.'!L10","v":0},27]
[2000,"COSMETICOS",null,null,28]
[2001,"PERFUMES",null,{"$f":"'COSTO C.'!L11","v":0},29]
[2002,"PINTURAS DE UÑA",null,{"$f":"'COSTO C.'!L12","v":0},30]
[2003,"PINTURAS DE LABIO",null,{"$f":"'COSTO C.'!L13","v":0},{"$f":"'COSTO C.'!M13","v":0}]
[2004,"LAPIZ DE CEJAS",null,{"$f":"'COSTO C.'!L14","v":0},{"$f":"'COSTO C.'!M14","v":0}]

{"sheet":"K","index":5,"n_rows":199,"n_cols":10,"rows_kept":199,"cut":false,"hidden":true,"merged":[[0,0,0,8],[2,5,2,6],[2,7,2,9],[3,0,4,0],[3,1,3,2],[3,3,4,3],[3,4,4,4],[3,5,4,5],[3,6,4,6],[3,7,3,9]]}
["MOVIMIENTO DE INVENTARIOS"]
["DEL",{"$f":"BASE!A4","v":"2013-05-25"},"AL ",{"$f":"TODAY()","v":"2013-05-28"}]
[null,null,null,null,{"$f":"IF(MENU!G19<>\"\",VLOOKUP(MENU!G19,CATALOGO,1,0))","v":1002},"PRODUCTO:",null,{"$f":"IF(MENU!G19<>\"\",VLOOKUP(MENU!G19,CATALOGO,2,0))","v":"AZUCAR"}]
["FECHA","Nº DE FACTURA",null,"CODIGO","PRODUCTO","DESCRIPCION","PREC-\nCOST","CANTIDADES"]
[null,"COMPRA","VENTA",null,null,null,null,"ENTRADA","SALIDA","SALDOS"]
[null,null,null,null,null,null,null,null,null,{"$f":"H6-I6","v":0}]
[null,null,null,null,null,null,null,null,null,{"$f":"IF((H7-I7)<>0,(H7-I7+J6),\"\")","v":""}]
[null,null,null,null,null,null,null,null,null,{"$f":"IF((H8-I8)<>0,(H8-I8+J7),\"\")","v":""}]
[null,null,null,null,null,null,null,null,null,""]
[null,null,null,null,null,null,null,null,null,""]
[null,null,null,null,null,null,null,null,null,""]
[null,null,null,null,null,null,null,null,null,""]
[null,null,null,null,null,null,null,null,null,""]
[null,null,null,null,null,null,null,null,null,""]
[null,null,null,null,null,null,null,null,null,""]
[null,null,null,null,null,null,null,null,null,""]
[null,null,null,null,null,null,null,null,null,""]
[null,null,null,null,null,null,null,null,null,""]
[null,null,null,null,null,null,null,null,null,""]
[null,null,null,null,null,null,null,null,null,""]
[null,null,null,null,null,null,null,null,null,""]
[null,null,null,null,null,null,null,null,null,""]
[null,null,null,null,null,null,null,null,null,""]
[null,null,null,null,null,null,null,null,null,""]
[null,null,null,null,null,null,null,null,null,""]
[null,null,null,null,null,null,null,null,null,""]
[null,null,null,null,null,null,null,null,null,""]
[null,null,null,null,null,null,null,null,null,""]
[null,null,null,null,null,null,null,null,null,""]
[null,null,null,null,null,null,null,null,null,""]
[null,null,null,null,null,null,null,null,null,""]
[null,null,null,null,null,null,null,null,null,""]
[null,null,null,null,null,null,null,null,null,""]
[null,null,null,null,null,null,null,null,null,""]
[null,null,null,null,null,null,null,null,null,""]
[null,null,null,null,null,null,null,null,null,""]
[null,null,null,null,null,null,null,null,null,""]
[null,null,null,null,null,null,null,null,null,""]
[null,null,null,null,null,null,null,null,null,""]
[null,null,null,null,null,null,null,null,null,""]
[null,null,null,null,null,null,null,null,null,""]
[null,null,null,null,null,null,null,null,null,""]
[null,null,null,null,null,null,null,null,null,""]
[null,null,null,null,null,null,null,null,null,""]
[null,null,null,null,null,null,null,null,null,""]
[null,null,null,null,null,null,null,null,null,""]
[null,null,null,null,null,null,null,null,null,""]
[null,null,null,null,null,null,null,null,null,""]
[null,null,null,null,null,null,null,null,null,""]
[null,null,null,null,null,null,null,null,null,""]
[null,null,null,null,null,null,null,null,null,""]
[null,null,null,null,null,null,null,null,null,""]
[null,null,null,null,null,null,null,null,null,""]
[null,null,null,null,null,null,null,null,null,""]
[null,null,null,null,null,null,null,null,null,""]
[null,null,null,null,null,null,null,null,null,""]
[null,null,null,null,null,null,null,null,null,""]
[null,null,null,null,null,null,null,null,null,""]
[null,null,null,null,null,null,null,null,null,""]
[null,null,null,null,null,null,null,null,null,""]
{"$rows_left_out":140}
{"sheet":"E","index":6,"n_rows":35,"n_cols":10,"rows_kept":35,"cut":false,"hidden":true,"merged":[[0,0,0,7],[2,5,2,7],[3,4,4,4],[3,3,4,3],[3,5,3,7],[3,0,4,0],[3,2,4,2]]}
["ESTADO DE CUENTA CLIENTES"]
["DEL",{"$f":"BASE!A4","v":"2013-05-25"},"AL",{"$f":"TODAY()","v":"2013-05-28"}]
[null,null,null,null,{"$f":"IF(MENU!G21<>\"\",VLOOKUP(MENU!G21,CLIENTES,2,0))","v":112001},{"$f":"IF(MENU!G21<>\"\",VLOOKUP(MENU!G21,CLIENTES,1,0))","v":"CARLOS PEREZ ESTRELLA"}]
["FECHA","Nº DE FACT.","CLIENTES","COD.\nCONT.","DESCRIPCION","VALORES"]
[null,"VENTA",null,null,null,"DEBE","HABER","SALDO"]
[null,null,null,null,null,null,null,{"$f":"F6-G6","v":0},null,{"$f":"E!H6","v":0}]
[null,null,null,null,null,null,null,{"$f":"IF((F7-G7)<>0,(F7-G7+H6),\"\")","v":""}]
[null,null,null,null,null,null,null,{"$f":"IF((F8-G8)<>0,(F8-G8+H7),\"\")","v":""}]
[null,null,null,null,null,null,null,""]
[null,null,null,null,null,null,null,""]
[null,null,null,null,null,null,null,""]
[null,null,null,null,null,null,null,""]
[null,null,null,null,null,null,null,""]
[null,null,null,null,null,null,null,""]
[null,null,null,null,null,null,null,""]
[null,null,null,null,null,null,null,""]
[null,null,null,null,null,null,null,""]
[null,null,null,null,null,null,null,""]
[null,null,null,null,null,null,null,""]
[null,null,null,null,null,null,null,""]
[null,null,null,null,null,null,null,""]
[null,null,null,null,null,null,null,""]
[null,null,null,null,null,null,null,""]
[null,null,null,null,null,null,null,""]
[null,null,null,null,null,null,null,""]
[null,null,null,null,null,null,null,""]
[null,null,null,null,null,null,null,""]
[null,null,null,null,null,null,null,""]
[null,null,null,null,null,null,null,""]
[null,null,null,null,null,null,null,""]
[null,null,null,null,null,null,null,""]
[null,null,null,null,null,null,null,""]
[null,null,null,null,null,null,null,""]
[null,null,null,null,null,null,null,""]
[null,null,null,null,null,null,null,""]

{"sheet":"P","index":7,"n_rows":57,"n_cols":8,"rows_kept":57,"cut":false,"hidden":true,"merged":[[0,0,0,7],[2,5,2,7],[3,0,4,0],[3,2,4,2],[3,3,4,3],[3,4,4,4],[3,5,3,7]]}
["ESTADO DE CUENTA X PAGAR"]
["DEL",{"$f":"BASE!A4","v":"2013-05-25"},"AL",{"$f":"TODAY()","v":"2013-05-28"}]
[null,null,null,null,{"$f":"IF(MENU!G23<>\"\",VLOOKUP(MENU!G23,Proveedor,2,0))","v":2111002},{"$f":"IF(MENU!G23<>\"\",VLOOKUP(MENU!G23,Proveedor,1,0))","v":"DISTRIBUIDORA LACTEOS S.A."}]
["FECHA","Nº DE FACT.","PROVEEDOR","COD.\nCONT.","DESCRIPCION","VALORES"]
[null,"COMPRA",null,null,null,"DEBE","HABER","SALDO"]
[null,null,null,null,null,null,null,{"$f":"G6-F6","v":0}]
[null,null,null,null,null,null,null,{"$f":"IF((F7-G7)<>0,(F7-G7+H6),\"\")","v":""}]
[null,null,null,null,null,null,null,{"$f":"IF((F8-G8)<>0,(F8-G8+H7),\"\")","v":""}]
[null,null,null,null,null,null,null,""]
[null,null,null,null,null,null,null,""]
[null,null,null,null,null,null,null,""]
[null,null,null,null,null,null,null,""]
[null,null,null,null,null,null,null,""]
[null,null,null,null,null,null,null,""]
[null,null,null,null,null,null,null,""]
[null,null,null,null,null,null,null,""]
[null,null,null,null,null,null,null,""]
[null,null,null,null,null,null,null,""]
[null,null,null,null,null,null,null,""]
[null,null,null,null,null,null,null,""]
[null,null,null,null,null,null,null,""]
[null,null,null,null,null,null,null,""]
[null,null,null,null,null,null,null,""]
[null,null,null,null,null,null,null,""]
[null,null,null,null,null,null,null,""]
[null,null,null,null,null,null,null,""]
[null,null,null,null,null,null,null,""]
[null,null,null,null,null,null,null,""]
[null,null,null,null,null,null,null,""]
[null,null,null,null,null,null,null,""]
[null,null,null,null,null,null,null,""]
[null,null,null,null,null,null,null,""]
[null,null,null,null,null,null,null,""]
[null,null,null,null,null,null,null,""]
[null,null,null,null,null,null,null,""]
[null,null,null,null,null,null,null,""]
[null,null,null,null,null,null,null,""]
[null,null,null,null,null,null,null,""]
[null,null,null,null,null,null,null,""]
[null,null,null,null,null,null,null,""]
[null,null,null,null,null,null,null,""]
[null,null,null,null,null,null,null,""]
[null,null,null,null,null,null,null,""]
[null,null,null,null,null,null,null,""]
[null,null,null,null,null,null,null,""]
[null,null,null,null,null,null,null,""]
[null,null,null,null,null,null,null,""]
[null,null,null,null,null,null,null,""]
[null,null,null,null,null,null,null,""]
[null,null,null,null,null,null,null,""]
[null,null,null,null,null,null,null,""]
[null,null,null,null,null,null,null,""]
[null,null,null,null,null,null,null,""]
[null,null,null,null,null,null,null,""]
[null,null,null,null,null,null,null,""]
[null,null,null,null,null,null,null,""]
[null,null,null,null,null,null,null,""]

{"sheet":"CLIENTES","index":8,"n_rows":14,"n_cols":7,"rows_kept":14,"cut":false,"hidden":false,"merged":[[4,4,4,6],[0,0,0,6],[13,2,13,3]]}
["LISTA DE CLIENTES Y CONTROL DE CUENTAS POR COBRAR"]
[]
["DEL",{"$f":"BASE!A4","v":"2013-05-25"},"AL ",{"$f":"TODAY()","v":"2013-05-28"}]
[]
[null,null,null,null,"RESUMEN CUENTAS POR COBRAR"]
["NOMBRE DEL CLIENTE","ID. CONTABLE","DIRECCION","TELEFONO","DEBE","HABER","SALDO"]
["CARLOS PEREZ ESTRELLA",112001,"Bº LOMA VERDE",88405102]
["JUAN BLANDO CASTILLO",112002,"Bº SANTA INES",84091378]
["ROGER PEREZ BELLO",112003,"Bº PETER FERRERA",27922406]
["CARLOS SANDOBAL",112004,"Bº EL COCAL",27922405]
["RIGO GARTH",112005,"Bº EL MOLEDOR",27922408]
[]
[]
[null,null,"SUMA TOTAL CUENTAS X C",null,{"$f":"SUM(E7:E13)","v":0},{"$f":"SUM(F7:F13)","v":0},{"$f":"IF(E14>=0,E14-F14,\"\")","v":0}]

{"sheet":"PROVEEDORES","index":9,"n_rows":14,"n_cols":7,"rows_kept":14,"cut":false,"hidden":false,"merged":[[4,4,4,6],[13,2,13,3],[0,0,0,6]]}
["LISTA DE PROVEEDORES Y CONTROL DE CUENTAS POR PAGAR"]
[]
["DEL",{"$f":"BASE!A4","v":"2013-05-25"},"AL ",{"$f":"TODAY()","v":"2013-05-28"}]
[]
[null,null,null,null,"RESUMEN CUENTAS POR PAGAR"]
["NOMBRE DEL PROVEEDOR","COD. CONT.","DIRECCION","TELEFONO","DEBE","HABER","SALDO"]
["COMERCIAL STAR S.A.",2111001,"BILWI, Bº PETER FERRERA",27922406]
["DISTRIBUIDORA LACTEOS S.A.",2111002,"BILWI, Bº SANDINO",27922507]
["CASAPERLLAS S.A",2111003,"MANAUGA",27922406]
["TOYOTA MOTORS S.A.",2111004,"SAN JOSE",2240652]
[]
[]
[]
[null,null,"SUMA TOTAL CUENTAS X P",null,{"$f":"SUM(E7:E13)","v":0},{"$f":"SUM(F7:F13)","v":0},{"$f":"IF(F14=0,F14-E14,\"\")","v":0}]

{"sheet":"RESUMEN","index":10,"n_rows":29,"n_cols":8,"rows_kept":29,"cut":false,"hidden":false,"merged":[[6,2,6,4],[6,5,6,7],[0,0,0,7],[2,0,2,7],[28,2,28,4]]}
["NOMBRE DEL NEGOCIO"]
[]
["RESUMEN DE INVENTARIO MINIMO Y MAXIMO MAS UTLIDAD BRUTA DEL EJERCICIO"]
[]
["DEL",{"$f":"BASE!A4","v":"2013-05-25"},"AL ",{"$f":"TODAY()","v":"2013-05-28"}]
[]
[null,null,"RESUMEN DE KARDEX",null,null,"UTILIDAD BRUTA/V"]
["CODIGO","PRODUCTO","ENTRADA","SADLIDA","SALDOS","VENTAS ","COSTOS","UTILIDAD"]
[{"$f":"PRODUCTOS!A8","v":1000},{"$f":"PRODUCTOS!B8","v":"GRANOS BASICOS"}]
[{"$f":"PRODUCTOS!A9","v":1001},{"$f":"PRODUCTOS!B9","v":"ARROZ"}]
[{"$f":"PRODUCTOS!A10","v":1002},{"$f":"PRODUCTOS!B10","v":"AZUCAR"}]
[{"$f":"PRODUCTOS!A11","v":1003},{"$f":"PRODUCTOS!B11","v":"FRIJOLES"}]
[{"$f":"PRODUCTOS!A12","v":1004},{"$f":"PRODUCTOS!B12","v":"HARINA"}]
[{"$f":"PRODUCTOS!A13","v":2000},{"$f":"PRODUCTOS!B13","v":"COSMETICOS"}]
[{"$f":"PRODUCTOS!A14","v":2001},{"$f":"PRODUCTOS!B14","v":"PERFUMES"}]
[{"$f":"PRODUCTOS!A15","v":2002},{"$f":"PRODUCTOS!B15","v":"PINTURAS DE UÑA"}]
[{"$f":"PRODUCTOS!A16","v":2003},{"$f":"PRODUCTOS!B16","v":"PINTURAS DE LABIO"}]
[{"$f":"PRODUCTOS!A17","v":2004},{"$f":"PRODUCTOS!B17","v":"LAPIZ DE CEJAS"}]
[]
[]
[]
[]
[]
[]
[]
[]
[]
[]
[null,null,"SUMA TOTAL",null,null,{"$f":"SUM(F9:F28)","v":0},{"$f":"SUM(G9:G28)","v":0},0]

{"sheet":"COSTO C.","index":11,"n_rows":15,"n_cols":17,"rows_kept":15,"cut":false,"hidden":false,"merged":[[4,4,5,4],[4,14,5,14],[4,16,5,16],[4,15,5,15],[0,14,0,16],[0,0,0,12],[2,0,2,12],[4,7,5,7],[4,8,5,8],[4,10,5,10],[4,11,5,11],[4,12,5,12],[4,9,5,9],[4,5,4,6],[4,0,5,0],[4,1,5,1],[4,2,5,2],[4,3,5,3]]}
["TABLA DE CALCULO DEL COSTO COMERCIAL Y EL PRECIO DE VENTA",null,null,null,null,null,null,null,null,null,null,null,null,null,"CALCULO DEL FACTOR EQUIVALENTE"]
[]
["APLICA EL COSTO COMERCIAL METODO DE COSTOS POR RECARGOS Y EL METODO DEL FACTOR EQUIVALENTE"]
[]
["Nº","CANTIDAD","ARTICULO","COSTO/U","FACTURA \nTOTAL","REBAJA",null,"FACTURA \nNETO TOTAL","TRANSPORTE","FACT. EQUIV","COSTO TOTAL","COSTO C./U","PRECIO \nVENTA 60%",null,"DETALLES","%","IMPORTE"]
[null,null,null,null,null,"%","IMPORTE"]
[null,45,null,null,null,null,null,null,null,null,null,null,null,null,"TOTAL FACT.S/D"]
[null,46,null,null,null,null,null,null,null,null,null,null,null,null,"DESCUENTO"]
[null,47,null,null,null,null,null,null,null,null,null,null,null,null,"REBAJA"]
[null,48,null,null,null,null,null,null,null,null,null,null,null,null,"EMBALAJE"]
[null,49,null,null,null,null,null,null,null,null,null,null,null,null,"FLETE"]
[null,50,null,null,null,null,null,null,null,null,null,null,null,null,"RECARGOS"]
[null,null,null,null,null,null,null,null,null,null,null,null,null,null,"FACT. TOTAL"]
[]
[null,null,null,null,null,null,null,null,null,null,null,null,null,null,"FACTOR EQUIV."]